{"text_format":"1","workbook":"xlsx","n_sheets":19,"sheets":["Instructions-Definitions","T1A - Site Summary","T1B - Site Performance Summary","T1C - Treatment Well Details","T1D - Process Summary","T1E - Maintenance Summary","T2 - GWR Performance","T3A - AS Performance","T3B - SVE Performance","T3C - MPX Performance","T4 - GW Elevation (FP)","T4A - GW Elevation (No FP)","T5 - GWR Analytical","T6 - MW Analytical ","T7 - SVE Analytical ","T8 - SVE-MPX Well","T9 - AS Well","T10 - GWR RW","T11 - System Influence"],"not_rendered":{"charts":0,"images":0,"macros":1,"external_links":0,"defined_names":19,"comments":1,"pivot_tables":0},"unopened":[],"bounds":{"document_bytes":16777216,"sheet_cells":100000,"rows_first":2000,"rows_last":500,"rows_between":2000,"halvings":0,"cell_chars":16384,"cell_head_chars":4096},"cells_cut":0,"cells_raw":0,"read":"whole","date_system":"1900"}

{"sheet":"Instructions-Definitions","index":0,"n_rows":50,"n_cols":3,"rows_kept":50,"cut":false,"hidden":false,"merged":[[0,1,0,8],[1,0,1,8]]}
["General Instructions:","This RA Summary Report should be prepared and submitted for each site.  A Summary Report along with the milestone worksheet, text and graphs are required for a complete O&M Report.   "]
["milestone worksheet, text and graphs are required for a complete O&M Report.   "]
[]
["Instructions for Each Table:"]
[null,"Table Name","Instructions"]
["T1A","Site Summary","Assessment, remediation, and operation history of the site"]
["T1B","Site Performance Summary","Milestone and runtime summary"]
["T1C","Treatment Well Detail","Description of treatment wells grouped by depth, type, process"]
["T1D","Process Summary","Description of remediation equipment"]
["T1E","Maintenance Summary","Description, type, and date of maintenance performed"]
{"$rows_left_out":41}
{"sheet":"T1A - Site Summary","index":1,"n_rows":68,"n_cols":14,"rows_kept":68,"cut":false,"hidden":false,"merged":[[50,0,50,8],[49,0,49,8],[24,4,24,6],[47,0,47,8],[48,0,48,8],[18,0,18,1],[18,2,18,3],[18,4,18,6],[18,7,18,8],[40,0,40,1],[46,0,46,8],[4,0,4,1],[7,0,7,1],[11,4,11,6],[6,4,6,6],[6,2,6,3],[5,7,5,8],[6,7,6,8],[10,0,10,1],[10,2,10,3],[32,0,32,1],[30,4,30,6],[25,4,25,6],[28,4,28,6],[13,0,13,1],[14,4,14,6],[15,4,15,6],[21,0,21,1],[21,2,21,3],[15,0,15,1],[13,2,13,3],[17,0,17,1],[13,4,13,6],[14,0,14,1],[34,7,34,8],[34,0,34,1],[35,2,35,3],[35,7,35,8],[35,4,35,6],[34,4,34,6],[40,2,40,3],[40,4,40,6],[40,7,40,8],[38,7,38,8],[39,0,39,1],[39,2,39,3],[39,4,39,6],[39,7,39,8],[38,0,38,1],[38,2,38,3],[38,4,38,6],[36,2,36,3],[35,0,35,1],[8,7,8,8],[9,7,9,8],[21,4,21,6],[22,4,22,6],[10,7,10,8],[22,7,22,8],[13,7,13,8],[10,4,10,6],[15,7,15,8],[17,7,17,8],[14,7,14,8],[17,4,17,6],[19,7,19,8],[21,7,21,8],[19,4,19,6],[8,4,8,6],[9,4,9,6],[11,7,11,8],[17,2,17,3],[19,2,19,3],[30,0,30,1],[26,2,26,3],[23,2,23,3],[24,2,24,3],[23,7,23,8],[29,7,29,8],[14,2,14,3],[25,7,25,8],[24,7,24,8],[11,0,11,1],[29,4,29,6],[22,2,22,3],[11,2,11,3],[15,2,15,3],[26,4,26,6],[30,7,30,8],[29,0,29,1],[26,0,26,1],[26,7,26,8],[29,2,29,3],[30,2,30,3],[42,7,42,8],[43,2,43,3],[43,4,43,6],[43,7,43,8],[44,4,44,6],[44,7,44,8],[42,0,42,1],[28,2,28,3],[32,7,32,8],[31,7,31,8],[28,7,28,8],[44,0,44,1],[43,0,43,1],[42,2,42,3],[44,2,44,3],[42,4,42,6],[32,2,32,3],[32,4,32,6],[31,4,31,6],[31,2,31,3],[36,7,36,8],[36,0,36,1],[36,4,36,6],[34,2,34,3],[2,0,2,1],[5,0,5,1],[6,0,6,1],[28,0,28,1],[23,0,23,1],[23,4,23,6],[25,2,25,3],[22,0,22,1],[8,2,8,3],[9,2,9,3],[2,2,2,8],[3,2,3,8],[5,2,5,3],[7,2,7,3],[4,4,4,6],[4,7,4,8],[7,4,7,6],[7,7,7,8],[4,2,4,3],[8,0,8,1],[9,0,9,1],[25,0,25,1],[24,0,24,1],[19,0,19,1]]}
[null,null,null,"TABLE 1A:  SITE SUMMARY",null,null,null,"RAI","Non-RAI"]
["Facility Information",null,null,null,null,null,null,"X",null,"Sand",null,"Startup","01 Alachua","PCS01"]
["Facility Name:",null,"DEP BMC",null,null,null,null,null,null,"Silty Sand",null,"Y1Q1","02 Baker","PCS02"]
["Facility Address:",null,"2600 Blairstone Road",null,null,null,null,null,null,"Clayey Sand",null,"Y1Q2","03 Bay","PCS03"]
["Facility City:",null,"Tallahassee",null,"Report Date (mm-dd-yy):",null,null,"2008-01-25",null,"Sandy Clay",null,"Y1Q3","04 Bradford","PCS04"]
["FDEP FAC ID:",null,123456789,null,"Report Period Start date:",null,null,null,null,"Clay",null,"Y1Q4","05 Brevard","PCS05"]
["County:",null,null,null,"Report Period End date:",null,null,null,null,"Limestone",null,"Y2Q1","06 Broward","PCS06"]
["Team/LP: ",null,null,null,"Report Period:",null,null,null,null,"Other",null,"Y2Q2","07 Calhoun","LP01 Alachua"]
["Team/LP PM:",null,null,null,"O&M Inspector:",null,null,null,null,null,null,"Y2Q3","08 Charlotte","LP05 Brevard"]
["Contractor:",null,null,null,"RA Specialist:",null,null,null,null,"Yes",null,"Y2Q4","09 Citrus","LP06 Broward"]
{"$rows_left_out":59}
{"sheet":"T1B - Site Performance Summary","index":2,"n_rows":33,"n_cols":17,"rows_kept":33,"cut":false,"hidden":false,"merged":[[2,11,2,13],[3,11,3,13],[3,2,3,8],[2,2,2,8],[4,2,4,8]]}
[null,null,null,"TABLE 1B: SITE PERFORMANCE SUMMARY"]
[]
["Facility Name:",null,{"$f":"'T1A - Site Summary'!C3","v":"DEP BMC"},null,null,null,null,null,null,"Startup Date:",null,{"$f":"'T1A - Site Summary'!H22","v":"2006-02-12"}]
["Facility Address:",null,{"$f":"CONCATENATE('T1A - Site Summary'!C4,\", \",'T1A - Site Summary'!C5)","v":"2600 Blairstone Road, Tallahassee"},null,null,null,null,null,null,"System Type:",null,{"$f":"'T1A - Site Summary'!C15","v":0}]
["FDEP FAC ID:",null,{"$f":"'T1A - Site Summary'!C6","v":123456789}]
[]
["Key Wells Meeting All Milestones (yes/no)"]
[null,"Q1","Q2","Q3","Q4","Q5","Q6","Q7","Q8","Q9","Q10","Q11","Q12","Q13","Q14","Q15","Q16"]
["MW-1"]
["MW-2"]
{"$rows_left_out":24}
{"sheet":"T1C - Treatment Well Details","index":3,"n_rows":45,"n_cols":5,"rows_kept":45,"cut":false,"hidden":false,"merged":[[1,1,1,2]]}
[null,"TABLE 1C - TREATMENT WELL DETAILS"]
["Facility Name:",{"$f":"'T1A - Site Summary'!C3","v":"DEP BMC"},null,"FDEP FAC ID:",{"$f":"'T1A - Site Summary'!C6","v":123456789}]
["Facility Address:",{"$f":"CONCATENATE('T1A - Site Summary'!C4,\", \",'T1A - Site Summary'!C5)","v":"2600 Blairstone Road, Tallahassee"},null,"System Type:",{"$f":"'T1A - Site Summary'!C15","v":0}]
[]
["Process Type","AS","SVE","AS","GWR"]
["Well Count",10,15,10]
["Well Name"]
["Well Type (HW, VW)","HW","VW","VW"]
["Diameter (inches)",4,4,2]
["Well Depth (feet)",40,20,30]
{"$rows_left_out":36}
{"sheet":"T1D - Process Summary","index":4,"n_rows":66,"n_cols":8,"rows_kept":66,"cut":false,"hidden":false,"merged":[[29,2,29,3],[29,5,29,6],[31,2,31,3],[27,7,27,8],[31,7,31,8],[29,7,29,8],[4,5,4,6],[8,5,8,6],[6,5,6,6],[9,5,9,6],[14,2,14,3],[14,5,14,6],[11,5,11,6],[9,2,9,3],[13,2,13,3],[13,5,13,6],[8,2,8,3],[11,2,11,3],[10,5,10,6],[45,0,45,1],[45,2,45,3],[36,0,36,1],[36,2,36,3],[36,5,36,6],[37,2,37,3],[37,5,37,6],[40,2,40,3],[40,5,40,6],[37,0,37,1],[38,2,38,3],[38,5,38,6],[61,0,61,1],[61,2,61,3],[61,5,61,6],[62,0,62,1],[63,0,63,1],[55,0,55,1],[60,5,60,6],[60,2,60,3],[53,0,53,1],[53,2,53,3],[53,5,53,6],[58,2,58,3],[58,5,58,6],[59,0,59,1],[59,2,59,3],[59,5,59,6],[54,0,54,1],[54,2,54,3],[4,7,4,8],[5,7,5,8],[6,7,6,8],[7,7,7,8],[9,7,9,8],[10,7,10,8],[64,2,64,3],[64,5,64,6],[1,2,1,3],[2,2,2,3],[1,7,1,8],[2,7,2,8],[64,7,64,8],[62,2,62,3],[62,5,62,6],[63,2,63,3],[55,5,55,6],[63,5,63,6],[44,2,44,3],[44,5,44,6],[52,2,52,3],[52,5,52,6],[47,2,47,3],[47,5,47,6],[61,7,61,8],[62,7,62,8],[63,7,63,8],[52,7,52,8],[53,7,53,8],[54,7,54,8],[58,7,58,8],[50,7,50,8],[13,7,13,8],[14,7,14,8],[15,7,15,8],[44,7,44,8],[45,7,45,8],[49,7,49,8],[46,7,46,8],[33,7,33,8],[34,7,34,8],[36,7,36,8],[41,7,41,8],[32,7,32,8],[59,7,59,8],[10,2,10,3],[10,0,10,1],[8,7,8,8],[5,5,5,6],[8,0,8,1],[18,7,18,8],[17,7,17,8],[15,0,15,1],[40,7,40,8],[37,7,37,8],[42,7,42,8],[11,7,11,8],[44,0,44,1],[52,0,52,1],[46,0,46,1],[45,5,45,6],[46,2,46,3],[46,5,46,6],[49,2,49,3],[49,5,49,6],[50,5,50,6],[50,0,50,1],[50,2,50,3],[4,2,4,3],[5,2,5,3],[6,2,6,3],[7,2,7,3],[7,5,7,6],[19,0,19,1],[13,0,13,1],[18,0,18,1],[18,2,18,3],[18,5,18,6],[7,0,7,1],[14,0,14,1],[4,0,4,1],[5,0,5,1],[6,0,6,1],[9,0,9,1],[15,2,15,3],[15,5,15,6],[23,5,23,6],[23,7,23,8],[20,7,20,8],[19,2,19,3],[19,5,19,6],[19,7,19,8],[20,2,20,3],[20,5,20,6],[16,0,16,1],[16,2,16,3],[16,5,16,6],[16,7,16,8],[17,0,17,1],[17,2,17,3],[17,5,17,6],[24,0,24,1],[24,2,24,3],[24,7,24,8],[22,2,22,3],[22,5,22,6],[22,7,22,8],[23,0,23,1],[23,2,23,3],[22,0,22,1],[26,0,26,1],[28,0,28,1],[28,2,28,3],[28,5,28,6],[26,2,26,3],[26,5,26,6],[24,5,24,6],[26,7,26,8],[25,2,25,3],[25,5,25,6],[25,7,25,8],[25,0,25,1],[27,0,27,1],[27,2,27,3],[27,5,27,6],[43,5,43,6],[43,7,43,8],[41,5,41,6],[42,0,42,1],[42,2,42,3],[42,5,42,6],[28,7,28,8],[31,0,31,1],[35,0,35,1],[35,2,35,3],[35,5,35,6],[35,7,35,8],[31,5,31,6],[32,0,32,1],[32,2,32,3],[32,5,32,6],[41,0,41,1],[41,2,41,3],[33,0,33,1],[33,2,33,3],[33,5,33,6],[34,0,34,1],[34,2,34,3],[34,5,34,6],[2,5,2,6],[64,0,64,1],[65,2,65,3],[65,5,65,6],[65,7,65,8],[56,2,56,3],[56,5,56,6],[56,7,56,8],[58,0,58,1],[60,0,60,1],[60,7,60,8],[47,7,47,8],[49,0,49,1],[51,0,51,1],[51,2,51,3],[51,5,51,6],[51,7,51,8],[54,5,54,6],[55,2,55,3],[55,7,55,8],[38,7,38,8],[40,0,40,1],[43,0,43,1],[43,2,43,3]]}
[null,null,null,"TABLE 1D:  REMEDIAL PROCESS SUMMARY"]
["Facility Name:",null,{"$f":"'T1A - Site Summary'!C3","v":"DEP BMC"},null,null,"FDEP FAC ID:",null,{"$f":"'T1A - Site Summary'!C6","v":123456789}]
["Facility Address:",null,{"$f":"CONCATENATE('T1A - Site Summary'!C4,\", \",'T1A - Site Summary'!C5)","v":"2600 Blairstone Road, Tallahassee"},null,null,"System Type:",null,{"$f":"'T1A - Site Summary'!C15","v":0}]
[]
["Treatment Process 1:",null,"AS",null,null,"Serial Number:"]
["Equipment Type:",null,"rotary screw AC",null,null,"Property #"]
["Manufacturer:",null,null,null,null,"Enclosure Type:"]
["Model #",null,null,null,null,"Trailer Tag No."]
["Equipment HP:",null,null,null,null,"Process Flow (SCFM):"]
["Phase/Voltage:",null,null,null,null,"Process Pressure (psi):"]
{"$rows_left_out":57}
{"sheet":"T1E - Maintenance Summary","index":5,"n_rows":8,"n_cols":5,"rows_kept":8,"cut":false,"hidden":false,"merged":[[15,2,15,6],[16,2,16,6],[7,2,7,6],[10,2,10,6],[11,2,11,6],[12,2,12,6],[13,2,13,6],[14,2,14,6],[8,2,8,6],[9,2,9,6],[30,2,30,6],[23,2,23,6],[24,2,24,6],[17,2,17,6],[18,2,18,6],[19,2,19,6],[20,2,20,6],[21,2,21,6],[22,2,22,6],[25,2,25,6],[26,2,26,6],[27,2,27,6],[28,2,28,6],[29,2,29,6],[34,2,34,6],[35,2,35,6],[36,2,36,6],[31,2,31,6],[32,2,32,6],[33,2,33,6]]}
[]
["TABLE 1E:  REMEDIAL SYSTEM MAINTENANCE  SUMMARY"]
[]
["Facility Name:",{"$f":"'T1A - Site Summary'!C3","v":"DEP BMC"},null,"Report Date:",{"$f":"'T1A - Site Summary'!H5","v":"2008-01-25"}]
["Facility Address:",{"$f":"CONCATENATE('T1A - Site Summary'!C4,\", \",'T1A - Site Summary'!C5)","v":"2600 Blairstone Road, Tallahassee"},null,"Report Type:",{"$f":"'T1A - Site Summary'!H8","v":0}]
["FDEP#",{"$f":"'T1A - Site Summary'!C6","v":123456789},null,"Startup Date:",{"$f":"'T1A - Site Summary'!H22","v":"2006-02-12"}]
[]
["Date:","Type:","System Maintenance Description"]

{"sheet":"T2 - GWR Performance","index":6,"n_rows":65,"n_cols":16,"rows_kept":65,"cut":false,"hidden":false,"merged":[[3,7,3,8]]}
[]
["TABLE 2:  GROUND WATER RECOVERY SYSTEM PERFORMANCE SUMMARY"]
[null,null,null,null,null,null,null,null,null,null,null,"Treatment Process Status Codes:",null,"Code","Arrive","Depart"]
["Facility Name:",null,{"$f":"'T1A - Site Summary'!C3","v":"DEP BMC"},null,null,null,"Startup Date:",{"$f":"'T1A - Site Summary'!H22","v":"2006-02-12"},null,null,null,null,null,1,"on","on"]
["Facility ID#:",null,{"$f":"'T1A - Site Summary'!C6","v":123456789},null,null,null,null,null,null,null,null,null,null,2,"off","on"]
[null,null,null,null,null,null,null,null,null,null,null,null,null,3,"off","off"]
[null,"Design Flow:",5,"gpm",null,null,null,null,null,null,null,null,null,4,"on","off"]
[null,null,null,null,null,null,"Design Capacity Percentage = (Total Gallons Pumped/Design Flow)*(days/1440)"]
["Site Visit","Days Between","Days Since","Gallons","Instantaneous","Average","Total Gallons","Design Capacity","Design Capacity","Hour Meter","Daily operating design","% Runtime","% Runtime","Free Product",null,"Process "]
["Date","Site Visits","Startup","Pumped","Flow - GPM","GPM","Pumped","% (period)","% (total)","Reading","Runtime (hours)","(period)","(total)","Gals ","Total","Status"]
{"$rows_left_out":56}
{"sheet":"T3A - AS Performance","index":7,"n_rows":49,"n_cols":15,"rows_kept":49,"cut":false,"hidden":false,"merged":[[1,0,1,14],[4,2,4,7],[3,2,3,7],[10,14,11,14],[8,3,8,4],[8,5,8,6],[8,7,8,8]]}
[]
["TABLE 3A:  AIR SPARGING PERFORMANCE SUMMARY"]
[null,null,null,null,null,null,null,null,null,null,null,null,"Code","Arrive","Depart"]
["Facility Name:",null,{"$f":"'T1A - Site Summary'!C3","v":"DEP BMC"},null,null,null,null,null,"Startup Date:",null,{"$f":"'T1A - Site Summary'!H22","v":"2006-02-12"},null,1,"on","on"]
["Facility ID#:",null,{"$f":"'T1A - Site Summary'!C6","v":123456789},null,null,null,null,null,null,null,null,null,2,"off","on"]
[null,null,null,null,null,null,null,null,null,null,null,null,3,"off","off"]
[null,null,null,null,null,null,null,null,null,null,null,null,4,"on","off"]
[]
[null,null,null,"AS Compressor 1",null,"AS Compressor 2",null,"AS Compressor 3"]
["Site ","Days","Days","Hour","Daily","Hour","Daily","Hour","Daily","Hours of","Total Hours","Approved ","Percent","Percent","Process"]
{"$rows_left_out":40}
{"sheet":"T3B - SVE Performance","index":8,"n_rows":49,"n_cols":15,"rows_kept":49,"cut":false,"hidden":false,"merged":[[10,14,11,14],[1,0,1,14],[3,2,3,7],[4,2,4,7],[8,3,8,4],[8,5,8,6],[8,7,8,8]]}
[]
["TABLE 3B:  SOIL VAPOR EXTRACTION PERFORMANCE SUMMARY"]
[null,null,null,null,null,null,null,null,null,null,null,null,"Code","Arrive","Depart"]
["Facility Name:",null,{"$f":"'T1A - Site Summary'!C3","v":"DEP BMC"},null,null,null,null,null,"Startup Date:",null,{"$f":"'T1A - Site Summary'!H22","v":"2006-02-12"},null,1,"on","on"]
["Facility ID#:",null,{"$f":"'T1A - Site Summary'!C6","v":123456789},null,null,null,null,null,null,null,null,null,2,"off","on"]
[null,null,null,null,null,null,null,null,null,null,null,null,3,"off","off"]
[null,null,null,null,null,null,null,null,null,null,null,null,4,"on","off"]
[]
[null,null,null,"SVE Blower 1",null,"SVE Blower 2",null,"SVE Blower 3"]
["Site ","Days","Days","Hour","Daily","Hour","Daily","Hour","Daily","Hours of","Total Hours","Approved ","Percent","Percent","Process"]
{"$rows_left_out":40}
{"sheet":"T3C - MPX Performance","index":9,"n_rows":49,"n_cols":15,"rows_kept":49,"cut":false,"hidden":false,"merged":[[10,14,11,14],[1,0,1,14],[3,2,3,7],[4,2,4,7],[8,3,8,4],[8,5,8,6],[8,7,8,8]]}
[]
["TABLE 3C:  MULTIPHASE EXTRACTION PERFORMANCE SUMMARY"]
[null,null,null,null,null,null,null,null,null,null,null,null,"Code","Arrive","Depart"]
["Facility Name:",null,{"$f":"'T1A - Site Summary'!C3","v":"DEP BMC"},null,null,null,null,null,"Startup Date:",null,{"$f":"'T1A - Site Summary'!H22","v":"2006-02-12"},null,1,"on","on"]
["Facility ID#:",null,{"$f":"'T1A - Site Summary'!C6","v":123456789},null,null,null,null,null,null,null,null,null,2,"off","on"]
[null,null,null,null,null,null,null,null,null,null,null,null,3,"off","off"]
[null,null,null,null,null,null,null,null,null,null,null,null,4,"on","off"]
[]
[null,null,null,"MPX Pump 1",null,"MPX Pump 2",null,"MPX Pump 3"]
["Site ","Days","Days","Hour","Daily","Hour","Daily","Hour","Daily","Hours of","Total Hours","Approved ","Percent","Percent","Process"]
{"$rows_left_out":40}
{"sheet":"T4 - GW Elevation (FP)","index":10,"n_rows":39,"n_cols":21,"rows_kept":39,"cut":false,"hidden":false,"merged":[[3,10,3,12],[3,1,3,5],[6,2,6,3],[7,2,7,3],[6,6,6,7],[7,6,7,7],[6,10,6,11],[7,10,7,11],[7,14,7,15],[6,18,6,19],[7,18,7,19],[8,18,8,19],[9,18,9,19],[8,14,8,15],[9,14,9,15],[6,14,6,15],[10,18,10,19],[10,2,10,3],[9,2,9,3],[8,2,8,3],[8,6,8,7],[9,6,9,7],[10,6,10,7],[8,10,8,11],[9,10,9,11],[10,10,10,11],[10,14,10,15]]}
[]
["TABLE 4:  GROUNDWATER ELEVATION TABLE"]
[]
["Facility Name:",{"$f":"'T1A - Site Summary'!C3","v":"DEP BMC"},null,null,null,null,null,null,"Facility ID#:",null,{"$f":"'T1A - Site Summary'!C6","v":123456789},null,null,null,null,null,null,"All Measurements = Feet"]
[null," ",null,null,null,null,null,null,null,null,null,null,null,null,null,null,null,"No Data = Blank"]
[]
["WELL NO."]
["DIAMETER (inches)"]
["WELL DEPTH"]
["SCREEN INTERVAL"]
{"$rows_left_out":30}
{"sheet":"T4A - GW Elevation (No FP)","index":11,"n_rows":38,"n_cols":19,"rows_kept":38,"cut":false,"hidden":false,"merged":[[2,9,2,10],[2,1,2,5]]}
["TABLE 4A:  GROUNDWATER ELEVATION TABLE (No FP)"]
[]
["Facility Name:",{"$f":"'T1A - Site Summary'!C3","v":"DEP BMC"},null,null,null,null,null,"Facility ID#:",null,{"$f":"'T1A - Site Summary'!C6","v":123456789},null,null,null,null,null,null,"All Measurements = Feet"]
[null,null,null,null,null,null,null,null,null,null,null,null,null,null,null,null,"No Data = Blank"]
[]
["WELL NO."]
["DIAMETER (inches)"]
["WELL DEPTH"]
["SCREEN INTERVAL"]
["TOC ELEVATION"]
{"$rows_left_out":29}
{"sheet":"T5 - GWR Analytical","index":12,"n_rows":38,"n_cols":16,"rows_kept":38,"cut":false,"hidden":false,"merged":[[3,2,3,5]]}
[]
["TABLE 5:  GROUNDWATER  TREATMENT SYSTEM ANALYTICAL SUMMARY"]
[null,null,null,null,null,null,null,null,null,null,null,null,"If Non-Detect Use MDL \"U\""]
["Facility Name:",null,{"$f":"'T1A - Site Summary'!C3","v":"DEP BMC"},null,null,null,null,"Facility ID#:",null,{"$f":"'T1A - Site Summary'!C6","v":123456789},null,null,"Not Sampled = NS"]
[null,null,null,null,null,null,null,null,null,null,null,null,"Analytical Results = µg/l"]
[null,null,null,null,null,null,null,null,null,null,null,null,"Mass Recovered = lbs"]
["Sample",null,"Hour","Instantaneous","  Total Gallons",null,null,"Ethyl","Total","Total",null,null,"Dissolved","Total",null," VOA Mass"]
["Location","Date","Meter","Flow - GPM","Pumped","Benzene","Toluene","Benzene","Xylenes","VOA","MTBE","EDB","Lead","Lead","TRPH","Recovered (lbs)"]
[null,null,null,null,null,null,null,null,null,null,null,null,null,null,null,{"$f":"IF(B9=\"\",\"\",'T5 - GWR Analytical'!E9*J9*3.785*(1/1000000)*(1/1000)*2.2)","v":""}]
[null,null,null,null,null,null,null,null,null,null,null,null,null,null,null,{"$f":"IF(B10=\"\",\"\",(E10-E9)*((0.5*(J9+J10))*3.785*(1/1000000)*(1/1000)*2.2))","v":""}]
{"$rows_left_out":29}
{"sheet":"T6 - MW Analytical ","index":13,"n_rows":10,"n_cols":17,"rows_kept":10,"cut":false,"hidden":false,"merged":[[3,2,3,6],[3,10,3,11]]}
[]
["TABLE 6:   GROUNDWATER MONITORING WELL ANALYTICAL SUMMARY"]
[null,null,null,null,null,null,null,null,null,null,null,null,null,null,null,"If Non-Detect Use MDL \"U\""]
["Facility Name:",null,{"$f":"'T1A - Site Summary'!C3","v":"DEP BMC"},null,null,null,null,null,"Facility ID#:",null,{"$f":"'T1A - Site Summary'!C6","v":123456789},null,null,null,null,"Not Sampled = NS"]
[null,null,null,null,null,null,null,null,null,null,null,null,null,null,null,"Analytical Results = µg/l"]
["B= Base Line",null,null,"NADC ",100,400,300,200,"NA",200,2,"NA",150,140,280,280,50000]
["K= Key Well",null,null,"CTL'S",1,40,30,20,"NA",20,0.02,"NA",15,14,28,28,5000]
["Location","Screen",null,null,null,null,"Ethyl","Total","Total",null,null,"Dissolved","Total","Naptha-","Methyl","Methyl"]
[null,"Int.","Date","DTW","Benzene","Toluene","Benzene","Xylenes","VOA","MTBE","EDB","Lead","Lead","lene","nap, 1","nap, 2","TRPH"]
["MW-1"]
{"$rows_left_out":1}
{"sheet":"T7 - SVE Analytical ","index":14,"n_rows":38,"n_cols":14,"rows_kept":38,"cut":false,"hidden":false,"merged":[[3,7,3,8],[3,2,3,4]]}
[]
["TABLE 7:  VAPOR TREATMENT SYSTEM ANALYTICAL SUMMARY"]
[null,null,null,null,null,null,null,null,null,null,"If Non-Detect Use MDL \"U\""]
["Facility Name:",null,{"$f":"'T1A - Site Summary'!C3","v":"DEP BMC"},null,null,null,"Facility ID#:",{"$f":"'T1A - Site Summary'!C6","v":123456789},null,null,"Not Sampled = NS"]
[null,null,null,null,null,null,null,null,null,null,"Analytical Results = mg/m3"]
[]
["Sample",null,"Hour","System Vacuum","Flow Rate","OVA",null,null,"Ethyl","Total","Total",null,"Emission","Total Mass"]
["Location","Date","Meter","(in of H20)","(scfm)","(ppm)","Benzene","Toluene","Benzene","Xylenes","VOA","TPH","Rate (lb/day)","Recovered (lbs)"]
[null,null,null,null,null,null,null,null,null,null,null,null,{"$f":"IF(L9=\"\",\"\",L9*E9*0.00008990535168)","v":""}]
[null,null,null,null,null,null,null,null,null,null,null,null,{"$f":"IF(L10=\"\",\"\",L10*E10*0.00008990535168)","v":""},{"$f":"IF(B10=\"\",\"\",(0.5*(M9+M10))*((C10-C9)/24))","v":""}]
{"$rows_left_out":29}
{"sheet":"T8 - SVE-MPX Well","index":15,"n_rows":16,"n_cols":16,"rows_kept":16,"cut":false,"hidden":false,"merged":[[1,0,1,15],[3,2,3,5],[3,8,3,10],[14,15,15,15],[14,6,15,6],[14,8,14,9],[14,10,15,10],[14,11,15,11],[14,13,14,14],[14,1,15,1],[14,5,15,5],[14,3,14,4]]}
[]
["TABLE 8:  SVE/MPX WELL DATA"]
[null,null,null,null,null,null,null,null,null,null,null,null,"All Measurements = Feet"]
[null,"Facility Name:",{"$f":"'T1A - Site Summary'!C3","v":"DEP BMC"},null,null,null,null,null,{"$f":"'T1A - Site Summary'!C6","v":123456789},null,null,null,"No Data = Blank"]
[null,null,null,null,null,null,null,null,null,null,null,null,"OVA Readings = ppm"]
[null,null,null,null,"Standard Temp = ",null,"°F",null,null,"Standard Pressure =",null,null,"Vacuum = in of H2O"]
[null,null,null,null,null,null,null,null,null,null,null,null,"Flow = scfm"]
["WELL NO."]
["DIAMETER (inches)"]
["WELL DEPTH"]
{"$rows_left_out":7}
{"sheet":"T9 - AS Well","index":16,"n_rows":16,"n_cols":17,"rows_kept":16,"cut":false,"hidden":false,"merged":[[1,0,1,16],[14,11,14,12],[14,15,14,16],[14,1,15,1],[14,9,15,9],[14,13,15,13],[14,5,15,5],[14,3,14,4],[14,7,14,8],[3,2,3,5],[3,8,3,9]]}
[]
["TABLE 9:  AIR SPARGING WELL DATA"]
[null,null,null,null,null,null,null,null,null,null,null,null,null,"All Measurements = Feet"]
[null,"Facility Name:",{"$f":"'T1A - Site Summary'!C3","v":"DEP BMC"},null,null,null,null,"Facility ID#:",{"$f":"'T1A - Site Summary'!C6","v":123456789},null,null,null,null,"No Data = Blank"]
[null,null,null,null,null,null,null,null,null,null,null,null,null,"Flow = SCFM"]
[null,null,null,null,"Standard Temp = ",null,"°F",null,null,"Standard Pressure = ",null,null,null,"Pressure = PSI"]
[]
["WELL NO."]
["DIAMETER (inches)"]
["WELL DEPTH"]
{"$rows_left_out":7}
{"sheet":"T10 - GWR RW","index":17,"n_rows":14,"n_cols":13,"rows_kept":14,"cut":false,"hidden":false,"merged":[[1,0,1,12],[10,7,10,8],[6,1,6,2],[7,1,7,2],[6,3,6,4],[7,3,7,4],[8,1,8,2],[9,1,9,2],[10,1,10,2],[9,3,9,4],[6,5,6,6],[7,5,7,6],[8,5,8,6],[9,5,9,6],[10,5,10,6],[8,7,8,8],[9,7,9,8],[11,1,11,2],[10,3,10,4],[11,3,11,4],[11,5,11,6],[8,3,8,4],[10,11,10,12],[11,11,11,12],[3,2,3,3],[6,11,6,12],[7,11,7,12],[8,11,8,12],[9,11,9,12],[11,7,11,8],[6,9,6,10],[7,9,7,10],[8,9,8,10],[9,9,9,10],[10,9,10,10],[11,9,11,10],[6,7,6,8],[7,7,7,8]]}
[]
["TABLE 10:  GROUNDWATER RECOVERY WELL DATA"]
[null,null,null,null,null,null,null,null,null,null,"All Measurements = Feet"]
[null,"Facility Name:",{"$f":"'T1A - Site Summary'!C3","v":"DEP BMC"},null,null,"Facility ID#:",{"$f":"'T1A - Site Summary'!C6","v":123456789},null,null,null,"No Data = Blank"]
[null,null,null,null,null,null,null,null,null,null,"Flow = GPM"]
[null,null," "]
["WELL NO."]
["DIAMETER (inches)"]
["WELL DEPTH"]
["SCREEN INT."]
{"$rows_left_out":5}
{"sheet":"T11 - System Influence","index":18,"n_rows":12,"n_cols":17,"rows_kept":12,"cut":false,"hidden":false,"merged":[[1,0,1,16],[4,8,4,9]]}
[]
["TABLE 11:   SYSTEM INFLUENCE MONITORING PARAMETERS "]
[]
[]
["Facility Name:",null,{"$f":"'T1A - Site Summary'!C3","v":"DEP BMC"},null,null,null,"Facility ID#:",null,123456789,null,null,"DTW = Feet",null,"Vac/Press = in of H2O"]
[null,null,null,null,null,null,null,null,null,null,null,"D.O. - mg/l",null,"Obs. - Visual Observations"]
[]
["WELL NO."]
["WELL DEPTH"]
["SCREEN INT."]
{"$rows_left_out":2}