{"text_format":"1","workbook":"xlsx","n_sheets":9,"sheets":["1.Sample_Info","2.LVS_Calculator","3.LVS_TAXA","4.RPS","5.HA_Stream_River","6.PhysChem","7.ExtenalBioFormat","Version Log","M code"],"not_rendered":{"charts":0,"images":0,"macros":1,"external_links":0,"defined_names":2,"comments":0,"pivot_tables":0},"unopened":[],"bounds":{"document_bytes":16777216,"sheet_cells":100000,"rows_first":2000,"rows_last":500,"rows_between":2000,"halvings":0,"cell_chars":16384,"cell_head_chars":4096},"cells_cut":0,"cells_raw":0,"read":"whole","date_system":"1900"}

{"sheet":"1.Sample_Info","index":0,"n_rows":24,"n_cols":15,"rows_kept":24,"cut":false,"hidden":false,"merged":[[0,0,0,1],[0,4,0,5],[8,4,9,4],[8,5,9,13],[10,4,11,4],[10,5,11,13],[0,9,0,15],[7,4,7,13],[8,14,9,14],[10,14,11,14],[20,1,24,1],[20,0,24,0],[12,14,13,14],[12,4,13,4],[17,4,17,10],[15,4,16,13],[14,5,14,13],[12,5,13,13]]}
["Site, Sample Information",null,null,null,"Results",null,null,null,null,"Geographic Coordinate Converter"]
["Sampling Entity",null,null,null,"LVS",{"$f":"IF('2.LVS_Calculator'!AB1=\"See Cell B5\",\"No Observations\",'2.LVS_Calculator'!AB1)","v":"No Observations"},"Auto Populated",null,null,"x/y","Degrees","Minutes","Seconds",null,"Decimal Degrees"]
["WIN Organization ID",null,null,null,"LVS Mean CofC",{"$f":"IF('2.LVS_Calculator'!AB3=\"No Observations\",\"No Observations\",IF('2.LVS_Calculator'!AB3=\"See Cell B5\",\"No Observations\",'2.LVS_Calculator'!AA3))","v":"No Observations"},"Auto Populated",null,null,"LATITUDE",null,null,null,null,{"$f":"K3+(L3/60)+(M3/3600)","v":0}]
["Sampler 1 Name",null,null,null,"LVS %FLEPPC",{"$f":"IF('2.LVS_Calculator'!AB3=\"No Observations\",\"No Observations\",IF('2.LVS_Calculator'!AB3=\"See Cell B5\",\"No Observations\",'2.LVS_Calculator'!AA4))","v":"No Observations"},"Auto Populated",null,null,"LONGITUDE",null,null,null,null,{"$f":"IF(K4<0,(K4-(L4/60)-(M4/3600)),(-1*(K4+(L4/60)+(M4/3600))))","v":0}]
["Sampler 2 Name",null,null,null,"HA",{"$f":"'5.HA_Stream_River'!B41","v":93},"Auto Populated"]
["List All Samplers Proficient* in the HA Method",null,null,null,"RPS",{"$f":"'4.RPS'!N12","v":"No Observations"},"Auto Populated"]
["Sample Date"]
["Waterbody Name",null,null,null,"Metric Comments From Metric Tabs"]
{"$rows_left_out":17}
{"sheet":"2.LVS_Calculator","index":1,"n_rows":72,"n_cols":44,"rows_kept":72,"cut":false,"hidden":false,"merged":[[5,24,7,28],[4,24,4,28],[71,0,73,0],[71,1,73,17],[4,22,4,23],[4,18,4,21],[5,13,5,17],[4,13,4,17],[4,10,4,12],[5,10,5,12],[7,0,7,17],[6,1,6,17],[70,0,70,5],[4,0,5,0],[4,2,4,3],[5,2,5,3],[2,14,2,17],[3,14,3,17],[3,1,3,4],[2,1,2,11],[2,12,2,13],[3,12,3,13],[3,6,3,11],[4,1,5,1],[4,4,4,9],[5,4,5,9],[0,24,1,26],[0,27,1,28],[2,24,2,25],[2,27,2,28],[3,24,3,25],[3,27,3,28],[0,22,1,23],[2,18,2,20],[3,18,3,20],[2,22,2,23],[3,22,3,23],[0,0,1,17],[0,18,1,21]]}
[" Linear Vegetation Survey Calculator \nVersion 2.0, June 2023",null,null,null,null,null,null,null,null,null,null,null,null,null,null,null,null,null,"LVS Summary",null,null,null,{"$f":"IF(B5=\"No\",\"Pass\",IF(B5=\"Required\",\"See Cell B5\",IF(SUM(Q10:Q68)<1,\"No Observations\",IF(OR(W3=\"Inconclusive\",W4=\"Inconclusive\"),\"Inconclusive\",IF(AND(W3=\"Pass\",W4=\"Pass\"),\"Pass\",IF(AND(W3=\"fail\",W4=\"fail\"),\"Fail\",\"Inconclusive\"))))))","v":"See Cell B5"},null," LVS Sample Result",null,null,{"$f":"IF(OR(V3=\">2 Dominant\",V4=\">2 Dominant\"),\"Error\",W1)","v":"See Cell B5"}]
[]
["Waterbody:",{"$f":"IF('1.Sample_Info'!B9=\"\",\"\",'1.Sample_Info'!B9)","v":""},null,null,null,null,null,null,null,null,null,null," Sample Date:",null,{"$f":"IF('1.Sample_Info'!B7=\"\",\"\",'1.Sample_Info'!B7)","v":""},null,null,null,"Mean CofC:",null,null,{"$f":"IFERROR(IF(AR70=1,\">2 Dominant\",SUMIFS(X10:X68,S10:S68,\"x\")/SUMIFS(R10:R68,S10:S68,\"x\")),\"No Data\")","v":"No Data"},{"$f":"IF(B5=\"No\",\"Pass\",IF(B5=\"Required\",\"See Cell B5\",IF(SUM(Q10:Q68)<1,\"No Observations\",IF(V3=\"-\",\"Inconclusive\",IF(AND(V3=\"No Data\",SUM(Q10:Q68)>0),\"Inconclusive\",IF(V3<2.5,\"Fail\",\"Pass\"))))))","v":"See Cell B5"},null," Mean CofC:",null,{"$f":"IF(B5=\"-\",\"See Cell B5\",IF(B5=\"No\",\"LVS < 2 SQM\",IFERROR(ROUND(IF(B5=\"-\",\"No Data\",IF(B5=\"no\",\"LVS < 2 SQM\",V3)),2),\"-\")))","v":"-"},{"$f":"IF(V3=\">2 Dominant\",\"Error\",W3)","v":"See Cell B5"}]
["WIN/STORET ID:",{"$f":"IF('1.Sample_Info'!B9=\"\",\"\",'1.Sample_Info'!B10)","v":""},null,null,null,"County:",{"$f":"IF('1.Sample_Info'!B9=\"\",\"\",'1.Sample_Info'!B13)","v":""},null,null,null,null,null,"Analyst Name:",null,{"$f":"IF('1.Sample_Info'!B9=\"\",\"\",'1.Sample_Info'!B15)","v":""},null,null,null,"%FLEPPC:",null,null,{"$f":"IFERROR(IF(AR70=1,\">2 Dominant\",(SUMIFS(R10:R68,D10:D68,\"Category*\"))/(SUMIFS(R10:R68,U10:U68,1)+SUMIFS(R10:R68,U10:U68,2)+SUMIFS(R10:R68,U10:U68,3)+SUMIFS(R10:R68,U10:U68,-9)+SUMIFS(R10:R68,U10:U68,\"null\"))),\"No Data\")","v":"No Data"},{"$f":"IF(B5=\"No\",\"Pass\",IF(B5=\"Required\",\"See Cell B5\",IF(SUM(Q10:Q68)<1,\"No Observations\",IF(V4=\"-\",\"Inconclusive\",IF(V4>0.254444444444444,\"Fail\",\"Pass\")))))","v":"See Cell B5"},null," %FLEPPC:",null,{"$f":"IF(B5=\"-\",\"See Cell B5\",IF(B5=\"No\",\"LVS < 2 SQM\",IFERROR(ROUND(IF(B5=\"-\",\"No Data\",IF(B5=\"no\",\"LVS < 2 SQM\",V4)),3),\"-\")))","v":"-"},{"$f":"IF(V4=\">2 Dominant\",\"Error\",W4)","v":"See Cell B5"}]
["Greater Than 2 Square Meters of Herbaceous Aquatic Vegetation?","Required","Data Entered By:",null,null,null,null,null,null,null," Data Reviewed By:",null,null,null,null,null,null,null,"Date Data Entered:",null,null,null,null,null,{"$f":"IF(AR70=1,\"Too Many Dominant Taxa Documented\",\"\")","v":""}]
[null,null,"Date Data Entered:",null,null,null,null,null,null,null," Date Reviewed:",null,null,null,null,null,null,null,null,null,null,null,null,null,{"$f":"IFERROR(\n_xlfn.IFS(AG70>2,\"Review Section 0-10\",\nAH70>2,\"Review Section 10-20\",\nAI70>2,\"Review Section 20-30\",\nAJ70>2,\"Review Section 30-40\",\nAK70>2,\"Review Section 40-50\",\nAL70>2,\"Review Section 50-60\",\nAM70>2,\"Review Section 60-70\",\nAN70>2,\"Review Section 70-80\",\nAO70>2,\"Review Section 80-90\",\nAP70>2,\"Review Section 90-100\"),\"\")","v":""}]
["Notes:"]
["Use \"P\" to denote taxa presence, \"D\" to denote dominant taxa, or \"C\" to denote co-dominant taxa."]
{"$rows_left_out":65}
{"sheet":"3.LVS_TAXA","index":2,"n_rows":1239,"n_cols":29,"rows_kept":1239,"cut":false,"hidden":false,"merged":[[0,1,3,5]]}
[null,"To Add Taxon to Calculator:  \nSelect taxon under column A on THIS Sheet, \nThen click Add Taxon Button",null,null,null,null,null,null,null,null,null,null,null,null,null,null,null,null,null,null,null,null,null,null,null,null,null,"If a taxon is not in the table Ashley O'Neal. \n"]
[null,null,null,null,null,null,null,null,null,null,null,null,null,null,null,null,null,null,null,null,null,null,null,null,null,null,null,"The table will be updated with the new taxon and an updated version of the calculator issued."]
[]
[null,null,null,null,null,null,null,null,null,null,null,null,null,null,null,null,null,null,null,null,null,null,null,null,null,null,null,"Ashley O'Neal","Ashley.ONeal@FloridaDEP.gov"]
["Taxon","Synonym(s)","CofC Score","FLEPPC Status","Wetland Status","Nativity"," 0-10"," 10-20"," 20-30"," 30-40"," 40-50"," 50-60"," 60-70"," 70-80"," 80-90"," 90-100","Occurrence","Occurrence of Herbaceous Wetland Taxon","Taxa has \nCofC","PK$TAXAID","PK$FLEPPC","WETLANDSTATUS","HERBWOOD","CofC x Occurrence Herbaceous Wetland Taxa","Quality Check (QC) Preformed By"]
["Abildgaardia",null,null,"-","-","-",null,null,null,null,null,null,null,null,null,null,{"$f":"COUNTIF(G6:P6,\"P\")+COUNTIF(G6:P6,\"C\")+COUNTIF(G6:P6,\"D\")","v":0},{"$f":"IF(AND(W6<>2,(OR(V6=3,V6=4,V6=5,V6=8,V6=9))),Q6,0)","v":0},{"$f":"IF(C6<>\"\",\"x\",\"-\")","v":"-"},"40282",-9,-9,-9,{"$f":"IFERROR(R6*C6,\"0\")","v":0}]
["Abildgaardia ovata",null,null,"-","FACW","Native",null,null,null,null,null,null,null,null,null,null,{"$f":"COUNTIF(G7:P7,\"P\")+COUNTIF(G7:P7,\"C\")+COUNTIF(G7:P7,\"D\")","v":0},{"$f":"IF(AND(W7<>2,(OR(V7=3,V7=4,V7=5,V7=8,V7=9))),Q7,0)","v":0},{"$f":"IF(C7<>\"\",\"x\",\"-\")","v":"-"},40283,3,4,1,0]
["Acer",null,null,"-","-","Native",null,null,null,null,null,null,null,null,null,null,0,0,"-",28727,3,1,2,0]
{"$rows_left_out":1232}
{"sheet":"4.RPS","index":3,"n_rows":60,"n_cols":17,"rows_kept":60,"cut":false,"hidden":false,"merged":[[3,0,5,0],[3,3,5,3],[3,4,5,4],[3,5,5,5],[0,0,0,13],[1,0,1,4],[1,5,1,6],[1,7,1,8],[1,9,1,13],[2,0,2,4],[2,5,2,6],[2,7,2,8],[2,9,2,13],[3,8,5,8],[3,9,5,9],[3,10,3,13],[4,10,4,13],[3,1,5,1],[3,2,5,2],[3,6,5,6],[3,7,5,7],[6,0,14,0],[6,5,14,5],[7,11,7,12],[10,11,10,12],[14,11,15,13],[15,0,23,0],[15,5,23,5],[11,11,11,12],[12,11,12,12],[22,11,22,13],[24,0,32,0],[24,5,32,5],[33,0,41,0],[33,5,41,5],[34,11,34,13],[30,11,30,13],[31,11,31,13],[33,11,33,13],[32,11,32,13],[36,11,36,13],[37,11,37,13],[39,11,39,13],[42,0,50,0],[42,5,50,5],[51,0,59,0],[51,5,53,13],[54,5,55,13],[56,5,57,13],[58,5,59,13],[42,11,42,13]]}
[" DEP FORM FD 9000-25  Rapid Periphyton Survey Field Sheet"]
["Site:",null,null,null,null,"County:",null,"Date:",null,"Investigator:"]
[{"$f":"IF('1.Sample_Info'!B9=\"\",\"\",'1.Sample_Info'!B9)","v":""},null,null,null,null,{"$f":"IF('1.Sample_Info'!B13=\"\",\"\",'1.Sample_Info'!B13)","v":""},null,{"$f":"IF('1.Sample_Info'!B7=\"\",\"\",'1.Sample_Info'!B7)","v":""},null,{"$f":"IF('1.Sample_Info'!B17=\"\",\"\",'1.Sample_Info'!B17)","v":""},null,null,null,null,"Auto Populated",null,"Current assessment"]
["Transect (m)","Point  \n1=right    \n 9=left","Algal Thickness Rank          \n (N-6, X)","Estimated \n(Y/N)","Canopy Cover","Transect (m)","Point  \n1=right    \n 9=left","Algal Thickness Rank          \n (N-6, X)","Estimated \n(Y/N)"," Canopy Cover","WIN/STORET Station ID:",null,null,null,null,null,{"$f":"IF(AND(N10=0,N11=0),\"No Observations\",IF(N12>25,\"Fail\",IF(N12>=20,\"Inconclusive See Dominant Taxa in Algal Sample\",\"Pass\")))","v":"No Observations"}]
[null,null,null,null,null,null,null,null,null,null,{"$f":"IF('1.Sample_Info'!B10=\"\",\"\",'1.Sample_Info'!B10)","v":""},null,null,null,"Auto Populated"]
[]
[0,1,null,null,null,60,1,null,null,null,null,"Secchi depth (m)"]
[null,2,null,null,null,null,2,null,null,null,null,"Estimated?  "]
{"$rows_left_out":53}
{"sheet":"5.HA_Stream_River","index":4,"n_rows":47,"n_cols":8,"rows_kept":47,"cut":false,"hidden":false,"merged":[[9,1,10,1],[11,1,13,1],[23,1,24,1],[25,1,26,1],[0,1,0,5],[1,1,1,2],[2,1,2,2],[4,1,5,1],[4,2,5,2],[3,3,3,4],[4,3,5,4],[4,5,5,5],[29,1,30,1],[21,1,21,5],[14,1,17,1],[40,1,40,2],[18,1,20,1],[33,1,34,1],[37,1,37,5],[39,1,39,2],[45,4,45,5],[46,4,46,5],[47,4,47,5],[43,1,43,2],[44,1,44,2],[45,1,45,2],[46,1,46,2],[47,1,47,2],[43,4,43,5],[44,4,44,5]]}
[null,"DEP Form FD 9000-5 Stream/River Habitat Assessment Field Sheet"]
[null,"SAMPLING AGENCY:  ",null,"WIN STATION ID:","DATE","RECEIVING BODY OF WATER:"]
[null,{"$f":"IF('1.Sample_Info'!B2=\"\",\"\",'1.Sample_Info'!B2)","v":""},null,{"$f":"IF('1.Sample_Info'!B9=\"\",\"\",'1.Sample_Info'!B10)","v":""},{"$f":"IF('1.Sample_Info'!B7=\"\",\"\",'1.Sample_Info'!B7)","v":""},{"$f":"IF('1.Sample_Info'!B9=\"\",\"\",'1.Sample_Info'!B14)","v":""}]
[null,"REMARKS:","COUNTY:","LOCATION:",null,"FIELD ID/NAME:"]
[null,null,{"$f":"IF('1.Sample_Info'!B9=\"\",\"\",'1.Sample_Info'!B13)","v":""},{"$f":"IF('1.Sample_Info'!B9=\"\",\"\",'1.Sample_Info'!B9)","v":""}]
[]
[]
[null,"Habitat Parameter","Optimal","Suboptimal","Marginal","Poor"]
{"$rows_left_out":40}
{"sheet":"6.PhysChem","index":5,"n_rows":119,"n_cols":82,"rows_kept":119,"cut":false,"hidden":false,"merged":[[104,29,104,60],[107,9,108,25],[106,3,109,8],[106,55,109,57],[98,3,98,8],[100,3,100,8],[102,3,102,8],[104,3,104,8],[91,55,91,64],[96,3,97,8],[97,9,97,11],[97,13,97,15],[97,17,97,19],[97,21,97,23],[96,42,102,65],[96,27,97,41],[91,32,91,34],[91,38,91,40],[91,44,91,46],[91,50,91,54],[93,4,94,11],[90,22,91,25],[93,12,94,15],[93,17,94,20],[82,45,83,47],[83,48,83,50],[83,54,83,58],[86,48,86,50],[86,54,86,58],[71,57,71,60],[73,50,73,51],[73,54,73,55],[75,45,76,47],[76,48,76,50],[76,54,76,58],[73,45,73,47],[70,45,71,51],[71,52,71,54],[78,48,78,50],[78,54,78,58],[80,51,80,64],[86,37,86,39],[86,42,86,43],[88,27,88,31],[88,32,88,36],[88,38,88,39],[88,40,88,43],[83,37,83,39],[83,42,83,43],[83,27,83,35],[86,27,86,35],[76,37,76,39],[76,42,76,43],[80,27,80,31],[80,32,80,36],[80,38,80,39],[80,40,80,43],[78,37,78,39],[78,42,78,43],[78,27,78,35],[76,27,76,35],[73,33,73,36],[73,39,73,41],[71,33,71,35],[71,38,71,41],[66,31,68,58],[66,27,68,30],[57,56,58,58],[60,56,61,58],[63,56,64,58],[63,27,64,30],[57,27,58,30],[57,39,58,41],[57,43,58,45],[57,47,58,49],[60,31,61,33],[60,35,61,37],[70,27,71,31],[73,27,73,30],[64,60,65,63],[63,60,63,63],[54,31,56,33],[54,35,56,37],[54,39,56,41],[54,43,56,45],[54,47,56,49],[54,51,56,54],[54,56,56,58],[54,60,56,63],[63,31,64,33],[63,35,64,37],[63,39,64,41],[63,43,64,45],[63,47,64,49],[60,51,61,54],[63,51,64,54],[60,39,61,41],[60,43,61,45],[60,47,61,49],[57,31,58,33],[57,35,58,37],[93,22,94,25],[82,12,84,15],[82,17,84,20],[82,22,84,25],[86,12,88,15],[86,17,88,20],[86,22,88,25],[82,4,84,11],[86,4,88,11],[90,4,91,11],[64,4,65,11],[67,4,68,11],[70,4,71,11],[73,17,76,20],[78,12,80,15],[78,17,80,20],[90,12,91,15],[90,17,91,20],[64,12,65,15],[64,17,65,20],[67,12,68,15],[67,17,68,20],[70,12,71,15],[70,17,71,20],[73,12,76,15],[78,22,80,25],[59,5,60,6],[52,61,52,63],[50,19,52,22],[54,3,55,9],[56,4,58,9],[57,12,57,13],[57,16,57,17],[57,20,57,21],[57,51,58,54],[60,17,63,20],[60,22,63,25],[54,27,55,30],[60,27,61,30],[59,9,60,12],[57,60,58,63],[61,61,61,63],[73,4,76,11],[78,4,80,11],[61,12,63,15],[64,22,65,25],[67,22,68,25],[70,22,71,25],[73,22,76,25],[48,61,48,63],[50,45,50,47],[50,50,50,52],[50,55,50,58],[50,61,50,63],[52,38,52,44],[48,45,48,47],[48,50,48,52],[48,55,48,58],[52,45,52,47],[52,50,52,52],[52,55,52,58],[48,33,48,36],[50,33,50,36],[46,38,47,47],[48,38,48,44],[50,38,50,44],[46,17,47,23],[48,19,48,22],[48,26,48,29],[50,26,50,29],[46,3,47,9],[48,5,48,8],[50,5,50,8],[48,12,48,15],[50,12,50,15],[40,31,42,38],[23,4,25,16],[44,2,45,65],[40,51,40,60],[31,35,32,39],[31,29,32,33],[37,6,37,13],[37,15,37,20],[37,21,37,26],[30,46,31,47],[35,43,36,45],[35,46,36,48],[30,51,31,53],[30,54,31,55],[35,51,36,53],[35,54,36,56],[30,59,31,61],[30,62,31,63],[35,59,36,61],[13,2,14,65],[40,3,42,8],[40,11,40,12],[42,11,42,16],[40,20,40,30],[42,20,42,25],[40,41,40,43],[42,41,42,46],[42,51,42,60],[15,4,17,33],[20,4,21,8],[20,10,21,14],[20,16,21,20],[20,22,21,26],[18,4,19,8],[20,28,21,32],[20,34,21,38],[20,40,21,44],[18,34,19,38],[18,40,19,44],[18,10,19,14],[18,16,19,20],[18,22,19,26],[18,28,19,32],[9,2,9,6],[11,2,11,7],[11,8,11,23],[9,7,9,62],[11,25,11,36],[11,37,11,62],[3,28,3,34],[5,28,5,34],[7,28,7,34],[3,2,3,6],[3,7,3,16],[5,2,5,6],[5,7,5,16],[7,2,7,6],[7,7,7,16],[3,25,3,27],[5,25,5,27],[7,25,7,27],[3,46,3,52],[5,46,5,52],[7,46,7,53],[7,54,7,65],[5,54,5,65],[3,54,3,65],[25,61,27,63],[30,43,31,45],[18,46,19,51],[23,38,25,40],[20,46,21,51],[17,55,19,64],[20,55,21,64],[16,40,17,51],[26,17,28,21],[23,19,25,21],[23,25,25,27],[23,31,25,34],[35,62,36,64],[107,58,108,64],[0,2,1,65],[35,3,36,9],[35,10,36,13],[23,42,24,65],[29,3,30,26],[31,5,32,8],[31,9,32,12],[31,16,32,19],[31,20,32,23],[29,27,30,41],[26,25,28,27],[26,31,28,34],[26,38,28,40],[26,4,28,14],[34,27,35,41],[36,30,36,32],[36,36,36,38],[35,14,36,15],[35,16,36,19],[35,20,36,21],[35,22,36,25],[25,57,27,60],[112,3,113,26],[114,3,115,26],[116,3,117,26],[118,3,119,26],[120,3,121,26],[112,32,113,55],[114,32,115,55],[116,32,117,55],[118,32,119,55],[120,32,121,55]]}
[null,null,"DEP Form FD 9000-3 Physical/Chemical Characterization Field Sheet "]
[]
[]
[null,null,"SAMPLE ID",null,null,null,null,null,null,null,null,null,null,null,null,null,null,null,null,null,null,null,null,null,null,"ORG ID",null,null,{"$f":"IF('1.Sample_Info'!B3=0,\"\",'1.Sample_Info'!B3)","v":""},null,null,null,null,null,null,null,null,null,null,null,null,null,null,null,null,null,"  LATITUDE",null,null,null,null,null,null,null,{"$f":"IF('1.Sample_Info'!B11=0,\"\",'1.Sample_Info'!B11)","v":""}]
[]
[null,null,"COUNTY",null,null,null,null,{"$f":"IF('1.Sample_Info'!B13=0,\"\",'1.Sample_Info'!B13)","v":""},null,null,null,null,null,null,null,null,null,null,null,null,null,null,null,null,null,"WIN #",null,null,{"$f":"IF('1.Sample_Info'!B10=0,\"\",'1.Sample_Info'!B10)","v":""},null,null,null,null,null,null,null,null,null,null,null,null,null,null,null,null,null,"  LONGITUDE",null,null,null,null,null,null,null,{"$f":"IF('1.Sample_Info'!B12=0,\"\",'1.Sample_Info'!B12)","v":""}]
[]
[null,null,"DATE",null,null,null,null,{"$f":"IF('1.Sample_Info'!B7=0,\"\",'1.Sample_Info'!B7)","v":""},null,null,null,null,null,null,null,null,null,null,null,null,null,null,null,null,null,"TIME",null,null,null,null,null,null,null,null,null,null,null,null,null,null,null,null,null,null,null,null,"SAMPLING AGENCY",null,null,null,null,null,null,null,{"$f":"IF('1.Sample_Info'!B2=0,\"\",'1.Sample_Info'!B2)","v":""}]
{"$rows_left_out":112}
{"sheet":"7.ExtenalBioFormat","index":6,"n_rows":46,"n_cols":16,"rows_kept":46,"cut":false,"hidden":false,"merged":[[21,5,21,14],[22,5,37,14],[21,0,37,3]]}
["WIN ORGANIZATION ID","WIN STATION NUMBER","STATION NAME","STATION DESCRIPTION","PRIMARY TYPE","WATERBODY NAME","LATITUDE","LONGITUDE","SAMPLE DATE","METRIC","RESULT","FIELD COMMENT","COLLECTOR","METRIC PROFICIENCY","SAMPLING ENTITY","LAB NAME"]
[{"$f":"IF('1.Sample_Info'!$B$3=0,\"\",'1.Sample_Info'!$B$3)","v":""},{"$f":"IF('1.Sample_Info'!$B$10=0,\"\",'1.Sample_Info'!$B$10)","v":""},{"$f":"D2","v":""},{"$f":"IF('1.Sample_Info'!$B$9=0,\"\",'1.Sample_Info'!$B$9)","v":""},"Stream",{"$f":"IF('1.Sample_Info'!$B$8=0,\"\",'1.Sample_Info'!$B$8)","v":""},{"$f":"IF('1.Sample_Info'!$B$11=0,\"\",'1.Sample_Info'!$B$11)","v":""},{"$f":"IF('1.Sample_Info'!$B$12=0,\"\",'1.Sample_Info'!$B$12)","v":""},{"$f":"IF('1.Sample_Info'!$B$7=0,\"\",'1.Sample_Info'!$B$7)","v":""},"HA (Substrate Diversity)",{"$f":"IF('5.HA_Stream_River'!H11<1,\"\",'5.HA_Stream_River'!H11)","v":15},null,{"$f":"IF('1.Sample_Info'!$B$16=0,\"\",'1.Sample_Info'!$B$16)","v":""},{"$f":"IF('1.Sample_Info'!$B$6=0,\"\",'1.Sample_Info'!$B$6)","v":""},{"$f":"IF('1.Sample_Info'!$B$2=0,\"\",'1.Sample_Info'!$B$2)","v":""}]
[{"$f":"IF('1.Sample_Info'!$B$3=0,\"\",'1.Sample_Info'!$B$3)","v":""},{"$f":"IF('1.Sample_Info'!$B$10=0,\"\",'1.Sample_Info'!$B$10)","v":""},{"$f":"D3","v":""},{"$f":"IF('1.Sample_Info'!$B$9=0,\"\",'1.Sample_Info'!$B$9)","v":""},"Stream",{"$f":"IF('1.Sample_Info'!$B$8=0,\"\",'1.Sample_Info'!$B$8)","v":""},{"$f":"IF('1.Sample_Info'!$B$11=0,\"\",'1.Sample_Info'!$B$11)","v":""},{"$f":"IF('1.Sample_Info'!$B$12=0,\"\",'1.Sample_Info'!$B$12)","v":""},{"$f":"IF('1.Sample_Info'!$B$7=0,\"\",'1.Sample_Info'!$B$7)","v":""},"HA (Substrate Availability)",{"$f":"IF('5.HA_Stream_River'!H14<1,\"\",'5.HA_Stream_River'!H14)","v":15},null,{"$f":"IF('1.Sample_Info'!$B$16=0,\"\",'1.Sample_Info'!$B$16)","v":""},{"$f":"IF('1.Sample_Info'!$B$6=0,\"\",'1.Sample_Info'!$B$6)","v":""},{"$f":"IF('1.Sample_Info'!$B$2=0,\"\",'1.Sample_Info'!$B$2)","v":""}]
[{"$f":"IF('1.Sample_Info'!$B$3=0,\"\",'1.Sample_Info'!$B$3)","v":""},{"$f":"IF('1.Sample_Info'!$B$10=0,\"\",'1.Sample_Info'!$B$10)","v":""},"",{"$f":"IF('1.Sample_Info'!$B$9=0,\"\",'1.Sample_Info'!$B$9)","v":""},"Stream",{"$f":"IF('1.Sample_Info'!$B$8=0,\"\",'1.Sample_Info'!$B$8)","v":""},{"$f":"IF('1.Sample_Info'!$B$11=0,\"\",'1.Sample_Info'!$B$11)","v":""},{"$f":"IF('1.Sample_Info'!$B$12=0,\"\",'1.Sample_Info'!$B$12)","v":""},{"$f":"IF('1.Sample_Info'!$B$7=0,\"\",'1.Sample_Info'!$B$7)","v":""},"HA (Water Velocity)",{"$f":"IF('5.HA_Stream_River'!H18<1,\"\",'5.HA_Stream_River'!H18)","v":15},null,{"$f":"IF('1.Sample_Info'!$B$16=0,\"\",'1.Sample_Info'!$B$16)","v":""},{"$f":"IF('1.Sample_Info'!$B$6=0,\"\",'1.Sample_Info'!$B$6)","v":""},{"$f":"IF('1.Sample_Info'!$B$2=0,\"\",'1.Sample_Info'!$B$2)","v":""}]
[{"$f":"IF('1.Sample_Info'!$B$3=0,\"\",'1.Sample_Info'!$B$3)","v":""},{"$f":"IF('1.Sample_Info'!$B$10=0,\"\",'1.Sample_Info'!$B$10)","v":""},"",{"$f":"IF('1.Sample_Info'!$B$9=0,\"\",'1.Sample_Info'!$B$9)","v":""},"Stream",{"$f":"IF('1.Sample_Info'!$B$8=0,\"\",'1.Sample_Info'!$B$8)","v":""},{"$f":"IF('1.Sample_Info'!$B$11=0,\"\",'1.Sample_Info'!$B$11)","v":""},{"$f":"IF('1.Sample_Info'!$B$12=0,\"\",'1.Sample_Info'!$B$12)","v":""},{"$f":"IF('1.Sample_Info'!$B$7=0,\"\",'1.Sample_Info'!$B$7)","v":""},"HA (Habitat Smothering)",{"$f":"IF('5.HA_Stream_River'!H21<1,\"\",'5.HA_Stream_River'!H21)","v":6},null,{"$f":"IF('1.Sample_Info'!$B$16=0,\"\",'1.Sample_Info'!$B$16)","v":""},{"$f":"IF('1.Sample_Info'!$B$6=0,\"\",'1.Sample_Info'!$B$6)","v":""},{"$f":"IF('1.Sample_Info'!$B$2=0,\"\",'1.Sample_Info'!$B$2)","v":""}]
[{"$f":"IF('1.Sample_Info'!$B$3=0,\"\",'1.Sample_Info'!$B$3)","v":""},{"$f":"IF('1.Sample_Info'!$B$10=0,\"\",'1.Sample_Info'!$B$10)","v":""},"",{"$f":"IF('1.Sample_Info'!$B$9=0,\"\",'1.Sample_Info'!$B$9)","v":""},"Stream",{"$f":"IF('1.Sample_Info'!$B$8=0,\"\",'1.Sample_Info'!$B$8)","v":""},{"$f":"IF('1.Sample_Info'!$B$11=0,\"\",'1.Sample_Info'!$B$11)","v":""},{"$f":"IF('1.Sample_Info'!$B$12=0,\"\",'1.Sample_Info'!$B$12)","v":""},{"$f":"IF('1.Sample_Info'!$B$7=0,\"\",'1.Sample_Info'!$B$7)","v":""},"HA (Primary Score)",{"$f":"IF('5.HA_Stream_River'!H22<1,\"\",'5.HA_Stream_River'!H22)","v":51},null,{"$f":"IF('1.Sample_Info'!$B$16=0,\"\",'1.Sample_Info'!$B$16)","v":""},{"$f":"IF('1.Sample_Info'!$B$6=0,\"\",'1.Sample_Info'!$B$6)","v":""},{"$f":"IF('1.Sample_Info'!$B$2=0,\"\",'1.Sample_Info'!$B$2)","v":""}]
[{"$f":"IF('1.Sample_Info'!$B$3=0,\"\",'1.Sample_Info'!$B$3)","v":""},{"$f":"IF('1.Sample_Info'!$B$10=0,\"\",'1.Sample_Info'!$B$10)","v":""},"",{"$f":"IF('1.Sample_Info'!$B$9=0,\"\",'1.Sample_Info'!$B$9)","v":""},"Stream",{"$f":"IF('1.Sample_Info'!$B$8=0,\"\",'1.Sample_Info'!$B$8)","v":""},{"$f":"IF('1.Sample_Info'!$B$11=0,\"\",'1.Sample_Info'!$B$11)","v":""},{"$f":"IF('1.Sample_Info'!$B$12=0,\"\",'1.Sample_Info'!$B$12)","v":""},{"$f":"IF('1.Sample_Info'!$B$7=0,\"\",'1.Sample_Info'!$B$7)","v":""},"HA (Artificial Channelization)",{"$f":"IF('5.HA_Stream_River'!H25<1,\"\",'5.HA_Stream_River'!H25)","v":6},null,{"$f":"IF('1.Sample_Info'!$B$16=0,\"\",'1.Sample_Info'!$B$16)","v":""},{"$f":"IF('1.Sample_Info'!$B$6=0,\"\",'1.Sample_Info'!$B$6)","v":""},{"$f":"IF('1.Sample_Info'!$B$2=0,\"\",'1.Sample_Info'!$B$2)","v":""}]
[{"$f":"IF('1.Sample_Info'!$B$3=0,\"\",'1.Sample_Info'!$B$3)","v":""},{"$f":"IF('1.Sample_Info'!$B$10=0,\"\",'1.Sample_Info'!$B$10)","v":""},"",{"$f":"IF('1.Sample_Info'!$B$9=0,\"\",'1.Sample_Info'!$B$9)","v":""},"Stream",{"$f":"IF('1.Sample_Info'!$B$8=0,\"\",'1.Sample_Info'!$B$8)","v":""},{"$f":"IF('1.Sample_Info'!$B$11=0,\"\",'1.Sample_Info'!$B$11)","v":""},{"$f":"IF('1.Sample_Info'!$B$12=0,\"\",'1.Sample_Info'!$B$12)","v":""},{"$f":"IF('1.Sample_Info'!$B$7=0,\"\",'1.Sample_Info'!$B$7)","v":""},"HA (Bank Stability - right bank)",{"$f":"IF('5.HA_Stream_River'!H28<1,\"\",'5.HA_Stream_River'!H28)","v":10},null,{"$f":"IF('1.Sample_Info'!$B$16=0,\"\",'1.Sample_Info'!$B$16)","v":""},{"$f":"IF('1.Sample_Info'!$B$6=0,\"\",'1.Sample_Info'!$B$6)","v":""},{"$f":"IF('1.Sample_Info'!$B$2=0,\"\",'1.Sample_Info'!$B$2)","v":""}]
{"$rows_left_out":39}
{"sheet":"Version Log","index":7,"n_rows":2,"n_cols":3,"rows_kept":2,"cut":false,"hidden":true,"merged":[]}
["Version","Publish Date","Changes, Updates"]
[1,null,"First publication"]

{"sheet":"M code","index":8,"n_rows":157,"n_cols":1,"rows_kept":157,"cut":false,"hidden":true,"merged":[]}
["// LVS Taxa"]
["let"]
["    Source = Oracle.Database(\"dbprod.dep.state.fl.us:1530/fdep\", "]
["        [HierarchicalNavigation=true, "]
["        Query=\""]
["SELECT DISTINCT "]
["  SBIO.ET$TAXAMSTR.SCINAME AS \"\"Taxon\"\","]
["  'Add_In_Excel'                         AS \"\"Synonym(s)\"\","]
{"$rows_left_out":149}